{"text_format":"3","workbook":"xlsx","n_sheets":5,"sheets":["Instructions","12-Month","18-Month","12-Month (no holidays)","Tables"],"not_rendered":{"defined_names":7,"comments":1},"read":"whole","date_system":"1900"}

{"sheet":"Instructions","index":0,"n_rows":25,"n_cols":2,"rows_kept":25,"merged":[[0,0,0,1]]}
["About Sri's Compact Calendar"]
["US : WEEK STARTING MONDAY"]
[]
["SET START DATE >","2024-01-01"]
[null,"If you need to change the starting date, just update it above. This is the default for each of the three styles of calendar in this spreadsheet. You can override each individual calendar's start date as well."]
[]
["About Compact Calendar","I use this calendar template for project estimating. It's compact, easy to print, and most importantly allows me to visualize time as blocks."]
[]
["Using the  Calendar","I usually just circle the starting dates of a task, then run a line out to the right side where I can make a note as to what it is. With the amount of whitespace available on the right, there's plenty of room to leave notes. After I'm done, I then either make a clean version with another sheet of paper, or type up the dates right on a copy of this spreadsheet"]
[]
["Printing Partial Calendars","Just select the rows I need then PRINT SELECTION from the print dialog. The headers/footers will be added automatically."]
[]
["Adding Holidays","The 'Tables' worksheet tab has a list of holidays that you can change. The capability for calculating holidays automatically have been added; please study the formulas to see how it works."]
[]
["Day Abbreviations","Change the WEEKDAY TABLE on the 'Tables' worksheet. Useful for localizing to other languages."]
[]
["Enjoy! ","Click on the CALENDAR worksheet tab below to see the calendar itself"]
[]
["Credits","Auto-calculation of first day based on year cell provided by Todd Foster http://www.boidem.org/"]
[null,"Automatic month calculation tip from Jim Service and \"Jenny\""]
[null,"Auto calculations of holidays from: http://cpearson.com"]
[null,"Month boundary trick from Daniel Kinal of Melbourne, Australia"]
[null,"ISO 8601 Week Information and calculation from http://www.rondebruin.nl/weeknumber.htm"]
[]
["Detailed Instructions","https://davidseah.com/node/compact-calendar/"]

{"sheet":"12-Month","index":1,"n_rows":61,"n_cols":11,"rows_kept":61,"merged":[[0,4,0,10],[60,0,60,10]]}
["STARTING DATE",{"$nulls":3},{"$f":"Instructions!B4","v":"2024-01-01"}]
[{"$f":"CONCATENATE(\" Compact Calendar \",YEAR(E1))","v":" Compact Calendar 2024"}]
[]
["#",null,"MONTH",null,{"$f":"VLOOKUP(WEEKDAY(E6),Tables!$A$45:$B$51,2)","v":"Mo"},{"$f":"VLOOKUP(WEEKDAY(F6),Tables!$A$45:$B$51,2)","v":"Tu"},{"$f":"VLOOKUP(WEEKDAY(G6),Tables!$A$45:$B$51,2)","v":"We"},{"$f":"VLOOKUP(WEEKDAY(H6),Tables!$A$45:$B$51,2)","v":"Th"},{"$f":"VLOOKUP(WEEKDAY(I6),Tables!$A$45:$B$51,2)","v":"Fr"},{"$f":"VLOOKUP(WEEKDAY(J6),Tables!$A$45:$B$51,2)","v":"Sa"},{"$f":"VLOOKUP(WEEKDAY(K6),Tables!$A$45:$B$51,2)","v":"Sun"}]
[]
[{"$f":"INT((E6-DATE(YEAR(E6-WEEKDAY(E6-1)+4),1,3)+WEEKDAY(DATE(YEAR(E6-WEEKDAY(E6-1)+4),1,3))+ 5)/7)","v":52},null,{"$f":"IF(SUM(1*(DAY(E6:K6)=1))>0,K6,\"\")","v":""},null,{"$f":"F6-1","v":"2023-12-25"},"2023-12-26","2023-12-27","2023-12-28","2023-12-29","2023-12-30",{"$f":"$E$1-WEEKDAY($E$1)+1","v":"2023-12-31"}]
[{"$f":"INT((E7-DATE(YEAR(E7-WEEKDAY(E7-1)+4),1,3)+WEEKDAY(DATE(YEAR(E7-WEEKDAY(E7-1)+4),1,3))+ 5)/7)","v":1},null,{"$f":"IF(SUM(1*(DAY(E7:K7)=1))>0,K7,\"\")","v":"2024-01-07"},null,{"$f":"K6+1","v":"2024-01-01"},{"$f":"E7+1","v":"2024-01-02"},"2024-01-03","2024-01-04","2024-01-05","2024-01-06","2024-01-07"]
[{"$f":"INT((E8-DATE(YEAR(E8-WEEKDAY(E8-1)+4),1,3)+WEEKDAY(DATE(YEAR(E8-WEEKDAY(E8-1)+4),1,3))+ 5)/7)","v":2},null,{"$f":"IF(SUM(1*(DAY(E8:K8)=1))>0,K8,\"\")","v":""},null,"2024-01-08",{"$f":"E8+1","v":"2024-01-09"},{"$f":"F8+1","v":"2024-01-10"},"2024-01-11","2024-01-12","2024-01-13","2024-01-14"]
[3,null,{"$f":"IF(SUM(1*(DAY(E9:K9)=1))>0,K9,\"\")","v":""},null,"2024-01-15","2024-01-16","2024-01-17","2024-01-18","2024-01-19","2024-01-20","2024-01-21"]
[4,null,{"$f":"IF(SUM(1*(DAY(E10:K10)=1))>0,K10,\"\")","v":""},null,"2024-01-22","2024-01-23","2024-01-24","2024-01-25","2024-01-26","2024-01-27","2024-01-28"]
[5,null,{"$f":"IF(SUM(1*(DAY(E11:K11)=1))>0,K11,\"\")","v":"2024-02-04"},null,"2024-01-29","2024-01-30","2024-01-31","2024-02-01","2024-02-02","2024-02-03","2024-02-04"]
[6,null,{"$f":"IF(SUM(1*(DAY(E12:K12)=1))>0,K12,\"\")","v":""},null,"2024-02-05","2024-02-06","2024-02-07","2024-02-08","2024-02-09","2024-02-10","2024-02-11"]
[7,null,{"$f":"IF(SUM(1*(DAY(E13:K13)=1))>0,K13,\"\")","v":""},null,"2024-02-12","2024-02-13","2024-02-14","2024-02-15","2024-02-16","2024-02-17","2024-02-18"]
[8,null,{"$f":"IF(SUM(1*(DAY(E14:K14)=1))>0,K14,\"\")","v":""},null,"2024-02-19","2024-02-20","2024-02-21","2024-02-22","2024-02-23","2024-02-24","2024-02-25"]
[9,null,{"$f":"IF(SUM(1*(DAY(E15:K15)=1))>0,K15,\"\")","v":"2024-03-03"},null,"2024-02-26","2024-02-27","2024-02-28","2024-02-29","2024-03-01","2024-03-02","2024-03-03"]
[10,null,{"$f":"IF(SUM(1*(DAY(E16:K16)=1))>0,K16,\"\")","v":""},null,"2024-03-04","2024-03-05","2024-03-06","2024-03-07","2024-03-08","2024-03-09","2024-03-10"]
[11,null,{"$f":"IF(SUM(1*(DAY(E17:K17)=1))>0,K17,\"\")","v":""},null,"2024-03-11","2024-03-12","2024-03-13","2024-03-14","2024-03-15","2024-03-16","2024-03-17"]
[12,null,{"$f":"IF(SUM(1*(DAY(E18:K18)=1))>0,K18,\"\")","v":""},null,"2024-03-18","2024-03-19","2024-03-20","2024-03-21","2024-03-22","2024-03-23","2024-03-24"]
[13,null,{"$f":"IF(SUM(1*(DAY(E19:K19)=1))>0,K19,\"\")","v":""},null,"2024-03-25","2024-03-26","2024-03-27","2024-03-28","2024-03-29","2024-03-30","2024-03-31"]
[14,null,{"$f":"IF(SUM(1*(DAY(E20:K20)=1))>0,K20,\"\")","v":"2024-04-07"},null,"2024-04-01","2024-04-02","2024-04-03","2024-04-04","2024-04-05","2024-04-06","2024-04-07"]
[15,null,{"$f":"IF(SUM(1*(DAY(E21:K21)=1))>0,K21,\"\")","v":""},null,"2024-04-08","2024-04-09","2024-04-10","2024-04-11","2024-04-12","2024-04-13","2024-04-14"]
[16,null,{"$f":"IF(SUM(1*(DAY(E22:K22)=1))>0,K22,\"\")","v":""},null,"2024-04-15","2024-04-16","2024-04-17","2024-04-18","2024-04-19","2024-04-20","2024-04-21"]
[17,null,{"$f":"IF(SUM(1*(DAY(E23:K23)=1))>0,K23,\"\")","v":""},null,"2024-04-22","2024-04-23","2024-04-24","2024-04-25","2024-04-26","2024-04-27","2024-04-28"]
[18,null,{"$f":"IF(SUM(1*(DAY(E24:K24)=1))>0,K24,\"\")","v":"2024-05-05"},null,"2024-04-29","2024-04-30","2024-05-01","2024-05-02","2024-05-03","2024-05-04","2024-05-05"]
[19,null,{"$f":"IF(SUM(1*(DAY(E25:K25)=1))>0,K25,\"\")","v":""},null,"2024-05-06","2024-05-07","2024-05-08","2024-05-09","2024-05-10","2024-05-11","2024-05-12"]
[20,null,{"$f":"IF(SUM(1*(DAY(E26:K26)=1))>0,K26,\"\")","v":""},null,"2024-05-13","2024-05-14","2024-05-15","2024-05-16","2024-05-17","2024-05-18","2024-05-19"]
[21,null,{"$f":"IF(SUM(1*(DAY(E27:K27)=1))>0,K27,\"\")","v":""},null,"2024-05-20","2024-05-21","2024-05-22","2024-05-23","2024-05-24","2024-05-25","2024-05-26"]
[22,null,{"$f":"IF(SUM(1*(DAY(E28:K28)=1))>0,K28,\"\")","v":"2024-06-02"},null,"2024-05-27","2024-05-28","2024-05-29","2024-05-30","2024-05-31","2024-06-01","2024-06-02"]
[23,null,{"$f":"IF(SUM(1*(DAY(E29:K29)=1))>0,K29,\"\")","v":""},null,"2024-06-03","2024-06-04","2024-06-05","2024-06-06","2024-06-07","2024-06-08","2024-06-09"]
[24,null,{"$f":"IF(SUM(1*(DAY(E30:K30)=1))>0,K30,\"\")","v":""},null,"2024-06-10","2024-06-11","2024-06-12","2024-06-13","2024-06-14","2024-06-15","2024-06-16"]
{"$rows_left_out":32}
{"sheet":"18-Month","index":2,"n_rows":91,"n_cols":11,"rows_kept":91,"merged":[[0,4,0,10],[90,0,90,10]]}
["STARTING DATE",{"$nulls":3},{"$f":"Instructions!B4","v":"2024-01-01"}]
[{"$f":"CONCATENATE(\" Compact Calendar \",YEAR(E1),\" 18mo\")","v":" Compact Calendar 2024 18mo"}]
[]
["#",null,"MONTH",null,{"$f":"VLOOKUP(WEEKDAY(E6),Tables!$A$45:$B$51,2)","v":"Mo"},{"$f":"VLOOKUP(WEEKDAY(F6),Tables!$A$45:$B$51,2)","v":"Tu"},{"$f":"VLOOKUP(WEEKDAY(G6),Tables!$A$45:$B$51,2)","v":"We"},{"$f":"VLOOKUP(WEEKDAY(H6),Tables!$A$45:$B$51,2)","v":"Th"},{"$f":"VLOOKUP(WEEKDAY(I6),Tables!$A$45:$B$51,2)","v":"Fr"},{"$f":"VLOOKUP(WEEKDAY(J6),Tables!$A$45:$B$51,2)","v":"Sa"},{"$f":"VLOOKUP(WEEKDAY(K6),Tables!$A$45:$B$51,2)","v":"Sun"}]
[]
[{"$f":"INT((E6-DATE(YEAR(E6-WEEKDAY(E6-1)+4),1,3)+WEEKDAY(DATE(YEAR(E6-WEEKDAY(E6-1)+4),1,3))+ 5)/7)","v":52},null,{"$f":"IF(SUM(1*(DAY(E6:K6)=1))>0,K6,\"\")","v":""},null,{"$f":"F6-1","v":"2023-12-25"},"2023-12-26","2023-12-27","2023-12-28","2023-12-29","2023-12-30",{"$f":"$E$1-WEEKDAY($E$1)+1","v":"2023-12-31"}]
[{"$f":"INT((E7-DATE(YEAR(E7-WEEKDAY(E7-1)+4),1,3)+WEEKDAY(DATE(YEAR(E7-WEEKDAY(E7-1)+4),1,3))+ 5)/7)","v":1},null,{"$f":"IF(SUM(1*(DAY(E7:K7)=1))>0,K7,\"\")","v":"2024-01-07"},null,{"$f":"K6+1","v":"2024-01-01"},{"$f":"E7+1","v":"2024-01-02"},"2024-01-03","2024-01-04","2024-01-05","2024-01-06","2024-01-07"]
[{"$f":"INT((E8-DATE(YEAR(E8-WEEKDAY(E8-1)+4),1,3)+WEEKDAY(DATE(YEAR(E8-WEEKDAY(E8-1)+4),1,3))+ 5)/7)","v":2},null,{"$f":"IF(SUM(1*(DAY(E8:K8)=1))>0,K8,\"\")","v":""},null,"2024-01-08","2024-01-09","2024-01-10","2024-01-11","2024-01-12","2024-01-13","2024-01-14"]
[3,null,{"$f":"IF(SUM(1*(DAY(E9:K9)=1))>0,K9,\"\")","v":""},null,"2024-01-15","2024-01-16","2024-01-17","2024-01-18","2024-01-19","2024-01-20","2024-01-21"]
[4,null,{"$f":"IF(SUM(1*(DAY(E10:K10)=1))>0,K10,\"\")","v":""},null,"2024-01-22","2024-01-23","2024-01-24","2024-01-25","2024-01-26","2024-01-27","2024-01-28"]
[5,null,{"$f":"IF(SUM(1*(DAY(E11:K11)=1))>0,K11,\"\")","v":"2024-02-04"},null,"2024-01-29","2024-01-30","2024-01-31","2024-02-01","2024-02-02","2024-02-03","2024-02-04"]
[6,null,{"$f":"IF(SUM(1*(DAY(E12:K12)=1))>0,K12,\"\")","v":""},null,"2024-02-05","2024-02-06","2024-02-07","2024-02-08","2024-02-09","2024-02-10","2024-02-11"]
[7,null,{"$f":"IF(SUM(1*(DAY(E13:K13)=1))>0,K13,\"\")","v":""},null,"2024-02-12","2024-02-13","2024-02-14","2024-02-15","2024-02-16","2024-02-17","2024-02-18"]
[8,null,{"$f":"IF(SUM(1*(DAY(E14:K14)=1))>0,K14,\"\")","v":""},null,"2024-02-19","2024-02-20","2024-02-21","2024-02-22","2024-02-23","2024-02-24","2024-02-25"]
[9,null,{"$f":"IF(SUM(1*(DAY(E15:K15)=1))>0,K15,\"\")","v":"2024-03-03"},null,"2024-02-26","2024-02-27","2024-02-28","2024-02-29","2024-03-01","2024-03-02","2024-03-03"]
[10,null,{"$f":"IF(SUM(1*(DAY(E16:K16)=1))>0,K16,\"\")","v":""},null,"2024-03-04","2024-03-05","2024-03-06","2024-03-07","2024-03-08","2024-03-09","2024-03-10"]
[11,null,{"$f":"IF(SUM(1*(DAY(E17:K17)=1))>0,K17,\"\")","v":""},null,"2024-03-11","2024-03-12","2024-03-13","2024-03-14","2024-03-15","2024-03-16","2024-03-17"]
[12,null,{"$f":"IF(SUM(1*(DAY(E18:K18)=1))>0,K18,\"\")","v":""},null,"2024-03-18","2024-03-19","2024-03-20","2024-03-21","2024-03-22","2024-03-23","2024-03-24"]
[13,null,{"$f":"IF(SUM(1*(DAY(E19:K19)=1))>0,K19,\"\")","v":""},null,"2024-03-25","2024-03-26","2024-03-27","2024-03-28","2024-03-29","2024-03-30","2024-03-31"]
[14,null,{"$f":"IF(SUM(1*(DAY(E20:K20)=1))>0,K20,\"\")","v":"2024-04-07"},null,"2024-04-01","2024-04-02","2024-04-03","2024-04-04","2024-04-05","2024-04-06","2024-04-07"]
[15,null,{"$f":"IF(SUM(1*(DAY(E21:K21)=1))>0,K21,\"\")","v":""},null,"2024-04-08","2024-04-09","2024-04-10","2024-04-11","2024-04-12","2024-04-13","2024-04-14"]
[16,null,{"$f":"IF(SUM(1*(DAY(E22:K22)=1))>0,K22,\"\")","v":""},null,"2024-04-15","2024-04-16","2024-04-17","2024-04-18","2024-04-19","2024-04-20","2024-04-21"]
[17,null,{"$f":"IF(SUM(1*(DAY(E23:K23)=1))>0,K23,\"\")","v":""},null,"2024-04-22",{"$f":"E23+1","v":"2024-04-23"},"2024-04-24","2024-04-25","2024-04-26","2024-04-27","2024-04-28"]
[18,null,{"$f":"IF(SUM(1*(DAY(E24:K24)=1))>0,K24,\"\")","v":"2024-05-05"},null,"2024-04-29","2024-04-30","2024-05-01","2024-05-02","2024-05-03","2024-05-04","2024-05-05"]
[19,null,{"$f":"IF(SUM(1*(DAY(E25:K25)=1))>0,K25,\"\")","v":""},null,"2024-05-06","2024-05-07","2024-05-08","2024-05-09","2024-05-10","2024-05-11","2024-05-12"]
[20,null,{"$f":"IF(SUM(1*(DAY(E26:K26)=1))>0,K26,\"\")","v":""},null,"2024-05-13","2024-05-14","2024-05-15","2024-05-16","2024-05-17","2024-05-18","2024-05-19"]
[21,null,{"$f":"IF(SUM(1*(DAY(E27:K27)=1))>0,K27,\"\")","v":""},null,"2024-05-20","2024-05-21","2024-05-22","2024-05-23","2024-05-24","2024-05-25","2024-05-26"]
[22,null,{"$f":"IF(SUM(1*(DAY(E28:K28)=1))>0,K28,\"\")","v":"2024-06-02"},null,"2024-05-27","2024-05-28","2024-05-29","2024-05-30","2024-05-31","2024-06-01","2024-06-02"]
[23,null,{"$f":"IF(SUM(1*(DAY(E29:K29)=1))>0,K29,\"\")","v":""},null,"2024-06-03","2024-06-04","2024-06-05","2024-06-06","2024-06-07","2024-06-08","2024-06-09"]
[24,null,{"$f":"IF(SUM(1*(DAY(E30:K30)=1))>0,K30,\"\")","v":""},null,"2024-06-10","2024-06-11","2024-06-12","2024-06-13","2024-06-14","2024-06-15","2024-06-16"]
{"$rows_left_out":62}
{"sheet":"12-Month (no holidays)","index":3,"n_rows":61,"n_cols":11,"rows_kept":61,"merged":[[0,4,0,10],[60,0,60,10]]}
["STARTING DATE",{"$nulls":3},{"$f":"Instructions!B4","v":"2024-01-01"}]
[{"$f":"CONCATENATE(\" Compact Calendar \",YEAR(E1))","v":" Compact Calendar 2024"}]
[]
["#",null,"MONTH",null,{"$f":"VLOOKUP(WEEKDAY(E6),Tables!$A$45:$B$51,2)","v":"Mo"},{"$f":"VLOOKUP(WEEKDAY(F6),Tables!$A$45:$B$51,2)","v":"Tu"},{"$f":"VLOOKUP(WEEKDAY(G6),Tables!$A$45:$B$51,2)","v":"We"},{"$f":"VLOOKUP(WEEKDAY(H6),Tables!$A$45:$B$51,2)","v":"Th"},{"$f":"VLOOKUP(WEEKDAY(I6),Tables!$A$45:$B$51,2)","v":"Fr"},{"$f":"VLOOKUP(WEEKDAY(J6),Tables!$A$45:$B$51,2)","v":"Sa"},{"$f":"VLOOKUP(WEEKDAY(K6),Tables!$A$45:$B$51,2)","v":"Sun"}]
[]
[{"$f":"INT((E6-DATE(YEAR(E6-WEEKDAY(E6-1)+4),1,3)+WEEKDAY(DATE(YEAR(E6-WEEKDAY(E6-1)+4),1,3))+ 5)/7)","v":52},null,{"$f":"IF(SUM(1*(DAY(E6:K6)=1))>0,K6,\"\")","v":""},null,{"$f":"F6-1","v":"2023-12-25"},"2023-12-26","2023-12-27","2023-12-28","2023-12-29","2023-12-30",{"$f":"$E$1-WEEKDAY($E$1)+1","v":"2023-12-31"}]
[{"$f":"INT((E7-DATE(YEAR(E7-WEEKDAY(E7-1)+4),1,3)+WEEKDAY(DATE(YEAR(E7-WEEKDAY(E7-1)+4),1,3))+ 5)/7)","v":1},null,{"$f":"IF(SUM(1*(DAY(E7:K7)=1))>0,K7,\"\")","v":"2024-01-07"},null,{"$f":"K6+1","v":"2024-01-01"},{"$f":"E7+1","v":"2024-01-02"},"2024-01-03","2024-01-04","2024-01-05","2024-01-06","2024-01-07"]
[{"$f":"INT((E8-DATE(YEAR(E8-WEEKDAY(E8-1)+4),1,3)+WEEKDAY(DATE(YEAR(E8-WEEKDAY(E8-1)+4),1,3))+ 5)/7)","v":2},null,{"$f":"IF(SUM(1*(DAY(E8:K8)=1))>0,K8,\"\")","v":""},null,"2024-01-08","2024-01-09","2024-01-10","2024-01-11","2024-01-12","2024-01-13","2024-01-14"]
[3,null,{"$f":"IF(SUM(1*(DAY(E9:K9)=1))>0,K9,\"\")","v":""},null,"2024-01-15","2024-01-16","2024-01-17","2024-01-18","2024-01-19","2024-01-20","2024-01-21"]
[4,null,{"$f":"IF(SUM(1*(DAY(E10:K10)=1))>0,K10,\"\")","v":""},null,"2024-01-22","2024-01-23","2024-01-24","2024-01-25","2024-01-26","2024-01-27","2024-01-28"]
[5,null,{"$f":"IF(SUM(1*(DAY(E11:K11)=1))>0,K11,\"\")","v":"2024-02-04"},null,"2024-01-29","2024-01-30","2024-01-31","2024-02-01","2024-02-02","2024-02-03","2024-02-04"]
[6,null,{"$f":"IF(SUM(1*(DAY(E12:K12)=1))>0,K12,\"\")","v":""},null,"2024-02-05","2024-02-06","2024-02-07","2024-02-08","2024-02-09","2024-02-10","2024-02-11"]
[7,null,{"$f":"IF(SUM(1*(DAY(E13:K13)=1))>0,K13,\"\")","v":""},null,"2024-02-12","2024-02-13","2024-02-14","2024-02-15","2024-02-16","2024-02-17","2024-02-18"]
[8,null,{"$f":"IF(SUM(1*(DAY(E14:K14)=1))>0,K14,\"\")","v":""},null,"2024-02-19","2024-02-20","2024-02-21","2024-02-22","2024-02-23","2024-02-24","2024-02-25"]
[9,null,{"$f":"IF(SUM(1*(DAY(E15:K15)=1))>0,K15,\"\")","v":"2024-03-03"},null,"2024-02-26","2024-02-27","2024-02-28","2024-02-29","2024-03-01","2024-03-02","2024-03-03"]
[10,null,{"$f":"IF(SUM(1*(DAY(E16:K16)=1))>0,K16,\"\")","v":""},null,"2024-03-04","2024-03-05","2024-03-06","2024-03-07","2024-03-08","2024-03-09","2024-03-10"]
[11,null,{"$f":"IF(SUM(1*(DAY(E17:K17)=1))>0,K17,\"\")","v":""},null,"2024-03-11","2024-03-12","2024-03-13","2024-03-14","2024-03-15","2024-03-16","2024-03-17"]
[12,null,{"$f":"IF(SUM(1*(DAY(E18:K18)=1))>0,K18,\"\")","v":""},null,"2024-03-18","2024-03-19","2024-03-20","2024-03-21","2024-03-22","2024-03-23","2024-03-24"]
[13,null,{"$f":"IF(SUM(1*(DAY(E19:K19)=1))>0,K19,\"\")","v":""},null,"2024-03-25","2024-03-26","2024-03-27","2024-03-28","2024-03-29","2024-03-30","2024-03-31"]
[14,null,{"$f":"IF(SUM(1*(DAY(E20:K20)=1))>0,K20,\"\")","v":"2024-04-07"},null,"2024-04-01","2024-04-02","2024-04-03","2024-04-04","2024-04-05","2024-04-06","2024-04-07"]
[15,null,{"$f":"IF(SUM(1*(DAY(E21:K21)=1))>0,K21,\"\")","v":""},null,"2024-04-08","2024-04-09","2024-04-10","2024-04-11","2024-04-12","2024-04-13","2024-04-14"]
[16,null,{"$f":"IF(SUM(1*(DAY(E22:K22)=1))>0,K22,\"\")","v":""},null,"2024-04-15","2024-04-16","2024-04-17","2024-04-18","2024-04-19","2024-04-20","2024-04-21"]
[17,null,{"$f":"IF(SUM(1*(DAY(E23:K23)=1))>0,K23,\"\")","v":""},null,"2024-04-22",{"$f":"E23+1","v":"2024-04-23"},"2024-04-24","2024-04-25","2024-04-26","2024-04-27","2024-04-28"]
[18,null,{"$f":"IF(SUM(1*(DAY(E24:K24)=1))>0,K24,\"\")","v":"2024-05-05"},null,"2024-04-29","2024-04-30","2024-05-01","2024-05-02","2024-05-03","2024-05-04","2024-05-05"]
[19,null,{"$f":"IF(SUM(1*(DAY(E25:K25)=1))>0,K25,\"\")","v":""},null,"2024-05-06","2024-05-07","2024-05-08","2024-05-09","2024-05-10","2024-05-11","2024-05-12"]
[20,null,{"$f":"IF(SUM(1*(DAY(E26:K26)=1))>0,K26,\"\")","v":""},null,"2024-05-13","2024-05-14","2024-05-15","2024-05-16","2024-05-17","2024-05-18","2024-05-19"]
[21,null,{"$f":"IF(SUM(1*(DAY(E27:K27)=1))>0,K27,\"\")","v":""},null,"2024-05-20","2024-05-21","2024-05-22","2024-05-23","2024-05-24","2024-05-25","2024-05-26"]
[22,null,{"$f":"IF(SUM(1*(DAY(E28:K28)=1))>0,K28,\"\")","v":"2024-06-02"},null,"2024-05-27","2024-05-28","2024-05-29","2024-05-30","2024-05-31","2024-06-01","2024-06-02"]
[23,null,{"$f":"IF(SUM(1*(DAY(E29:K29)=1))>0,K29,\"\")","v":""},null,"2024-06-03","2024-06-04","2024-06-05","2024-06-06","2024-06-07","2024-06-08","2024-06-09"]
[24,null,{"$f":"IF(SUM(1*(DAY(E30:K30)=1))>0,K30,\"\")","v":""},null,"2024-06-10","2024-06-11","2024-06-12","2024-06-13","2024-06-14","2024-06-15","2024-06-16"]
{"$rows_left_out":32}
{"sheet":"Tables","index":4,"n_rows":54,"n_cols":11,"rows_kept":54}
["HOLIDAY LOOKUP TABLE",{"$nulls":8},{"$f":"YEAR('12-Month'!$E$1)","v":2024},"year copied from 12-Month Calendar Worksheet"]
["The holidays in this table are calculated automatically. Change the STARTING DATE on the 12-Month worksheet will update this list"]
["Note that this table covers TWO YEARS!!!"]
[]
["DATE",null,"DESCRIPTION",null,"Mo","DoW","NthWk",null,null,"Notes"]
[{"$f":"IF(WEEKDAY(DATE($J$1,1,1))=1,DATE($J$1,1,2),IF(WEEKDAY(DATE($J$1,1,1))=7,DATE($J$1-1,12,31),DATE($J$1,1,1)))","v":"2024-01-01"},{"$f":"A6","v":"2024-01-01"},"New Year's Day (Obs)",{"$nulls":6},"Observed holiday is on weekday"]
[{"$f":"DATE($J$1,E7,1+((G7-(F7>=WEEKDAY(DATE($J$1,E7,1))))*7)+(F7-WEEKDAY(DATE($J$1,E7,1))))","v":"2024-01-15"},{"$f":"A7","v":"2024-01-15"},"Martin Luther King Day",null,1,2,3,null,null,"3rd Monday in January"]
[{"$f":"DATE($J$1,E8,1+((G8-(F8>=WEEKDAY(DATE($J$1,E8,1))))*7)+(F8-WEEKDAY(DATE($J$1,E8,1))))","v":"2024-02-19"},"2024-02-19","President's Day",null,2,2,3,null,null,"3rd Monday in February"]
[{"$f":"FLOOR(DATE($J$1,5,DAY(MINUTE($J$1/38)/2+56)),7)-34","v":"2024-03-31"},"2024-03-31","Easter Sunday",{"$nulls":6},"Calculated"]
[{"$f":"DATE($J$1, E10 + 1, 0) - MOD(WEEKDAY(DATE($J$1, E10 + 1, 0)) - F10, 7)","v":"2024-05-27"},"2024-05-27","Memorial Day",null,5,2,{"$nulls":3},"Last Monday in May (special calc)"]
[{"$f":"IF(WEEKDAY(DATE($J$1,E11,F11))=1,DATE($J$1,E11,F11+1),IF(WEEKDAY(DATE($J$1,E11,F11))=7,DATE($J$1,E11,F11-1),DATE($J$1,E11,F11)))","v":"2024-06-19"},"2024-06-19","Juneteenth (Obs)",null,6,19,{"$nulls":3},"Juneteenth"]
[{"$f":"IF(WEEKDAY(DATE($J$1,E12,F12))=1,DATE($J$1,E12,F12+1),IF(WEEKDAY(DATE($J$1,E12,F12))=7,DATE($J$1,E12,F12-1),DATE($J$1,E12,F12)))","v":"2024-07-04"},"2024-07-04","Independence Day (Obs)",null,7,4,{"$nulls":3},"Observed holiday is on weekday"]
[{"$f":"DATE($J$1,E13,1+((G13-(F13>=WEEKDAY(DATE($J$1,E13,1))))*7)+(F13-WEEKDAY(DATE($J$1,E13,1))))","v":"2024-09-02"},{"$f":"A13","v":"2024-09-02"},"Labor Day",null,9,2,1,null,null,"1st Monday in September"]
[{"$f":"DATE($J$1,E14,1+((G14-(F14>=WEEKDAY(DATE($J$1,E14,1))))*7)+(F14-WEEKDAY(DATE($J$1,E14,1))))","v":"2024-11-28"},{"$f":"A14","v":"2024-11-28"},"Thanksgiving Day",null,11,5,4,null,null,"4th Thursday in November"]
[{"$f":"DATE($J$1,11,11)","v":"2024-11-11"},{"$f":"A15","v":"2024-11-11"},"Veterans Day",{"$nulls":6},"Always November 11"]
[{"$f":"DATE($J$1,E16,F16)","v":"2024-12-25"},{"$f":"A16","v":"2024-12-25"},"Christmas Day",null,12,25,{"$nulls":3},"Always December 25"]
[{"$f":"IF(WEEKDAY(DATE($J$1,E17,F17))=1,DATE($J$1,E17,F17+1),IF(WEEKDAY(DATE($J$1,E17,F17))=7,DATE($J$1,E17,F17-1),DATE($J$1,E17,F17)))","v":"2024-12-25"},{"$f":"A17","v":"2024-12-25"},"Christmas Day (Obs)",null,12,25,{"$nulls":3},"If Dec 25 on weekend, add observed"]
[]
[{"$f":"IF(WEEKDAY(DATE($J$1+1,1,1))=1,DATE($J$1,1,2),IF(WEEKDAY(DATE($J$1+1,1,1))=7,DATE($J$1,12,31),DATE($J$1+1,1,1)))","v":"2025-01-01"},{"$f":"A19","v":"2025-01-01"},"New Year's Day (Obs)",{"$nulls":6},"Observed holiday is on weekday"]
[{"$f":"DATE($J$1+1,E20,1+((G20-(F20>=WEEKDAY(DATE($J$1+1,E20,1))))*7)+(F20-WEEKDAY(DATE($J$1+1,E20,1))))","v":"2025-01-20"},{"$f":"A20","v":"2025-01-20"},"Martin Luther King Day",null,1,2,3,null,null,"3rd Monday in January"]
[{"$f":"DATE($J$1+1,E21,1+((G21-(F21>=WEEKDAY(DATE($J$1+1,E21,1))))*7)+(F21-WEEKDAY(DATE($J$1+1,E21,1))))","v":"2025-02-17"},"2025-02-17","President's Day",null,2,2,3,null,null,"3rd Monday in February"]
[{"$f":"FLOOR(DATE($J$1+1,5,DAY(MINUTE($J$1/38)/2+56)),7)-34","v":"2025-03-30"},"2025-03-30","Easter Sunday",{"$nulls":6},"Calculated"]
[{"$f":"DATE($J$1+1, E23 + 1, 0) - MOD(WEEKDAY(DATE($J$1+1, E23 + 1, 0)) - F23, 7)","v":"2025-05-26"},"2025-05-26","Memorial Day",null,5,2,{"$nulls":3},"Last Monday in May (special calc)"]
[{"$f":"IF(WEEKDAY(DATE($J$1+1,E24,F24))=1,DATE($J$1+1,E24,F24+1),IF(WEEKDAY(DATE($J$1+1,E24,F24))=7,DATE($J$1+1,E24,F24-1),DATE($J$1+1,E24,F24)))","v":"2025-06-19"},"2025-06-19","Juneteenth (Obs)",null,6,19,{"$nulls":3},"Juneteenth"]
[{"$f":"IF(WEEKDAY(DATE($J$1+1,E25,F25))=1,DATE($J$1+1,E25,F25+1),IF(WEEKDAY(DATE($J$1+1,E25,F25))=7,DATE($J$1+1,E25,F25-1),DATE($J$1+1,E25,F25)))","v":"2025-07-04"},"2025-07-04","Independence Day (Obs)",null,7,4,{"$nulls":3},"Observed holiday is on weekday"]
[{"$f":"DATE($J$1+1,E26,1+((G26-(F26>=WEEKDAY(DATE($J$1+1,E26,1))))*7)+(F26-WEEKDAY(DATE($J$1+1,E26,1))))","v":"2025-09-01"},{"$f":"A26","v":"2025-09-01"},"Labor Day",null,9,2,1,null,null,"1st Monday in September"]
[{"$f":"DATE($J$1+1,E27,1+((G27-(F27>=WEEKDAY(DATE($J$1+1,E27,1))))*7)+(F27-WEEKDAY(DATE($J$1+1,E27,1))))","v":"2025-11-27"},{"$f":"A27","v":"2025-11-27"},"Thanksgiving Day",null,11,5,4,null,null,"4th Thursday in November"]
[{"$f":"DATE($J$1+1,11,11)","v":"2025-11-11"},{"$f":"A28","v":"2025-11-11"},"Veterans Day",{"$nulls":6},"Always November 11"]
[{"$f":"IF(WEEKDAY(DATE($J$1+1,E29,F29))=1,DATE($J$1+1,E29,F29+1),IF(WEEKDAY(DATE($J$1+1,E29,F29))=7,DATE($J$1+1,E29,F29-1),DATE($J$1+1,E29,F29)))","v":"2025-12-25"},{"$f":"A29","v":"2025-12-25"},"Christmas Day",null,12,25,{"$nulls":3},"Always December 25"]
[{"$f":"IF(WEEKDAY(DATE($J$1+1,E30,F30))=1,DATE($J$1+1,E30,F30+1),IF(WEEKDAY(DATE($J$1+1,E30,F30))=7,DATE($J$1+1,E30,F30-1),DATE($J$1+1,E30,F30)))","v":"2025-12-25"},{"$f":"A30","v":"2025-12-25"},"Christmas Day (Obs)",null,12,25,{"$nulls":3},"If Dec 25 on weekend, add observed"]
{"$rows_left_out":24}